Skip to content

chore: Switch to rolldown #58806

chore: Switch to rolldown

chore: Switch to rolldown #58806

Triggered via pull request September 23, 2026 18:34
Status Failure
Total duration 17m 34s
Artifacts 7

build.yml

on: pull_request
Get CI Metadata  /  Get Metadata
9s
Get CI Metadata / Get Metadata
Build tarballs
2m 3s
Build tarballs
Build Lambda layer
1m 31s
Build Lambda layer
Matrix: job_bundler_plugin_integration_tests
Matrix: job_node_integration_tests
Matrix: job_node_unit_tests
Lint
1m 38s
Lint
Circular Dependency Check
1m 36s
Circular Dependency Check
Browser Unit Tests
2m 40s
Browser Unit Tests
Bun Unit Tests
1m 10s
Bun Unit Tests
Deno Unit Tests
1m 18s
Deno Unit Tests
Cloudflare Integration Tests
6m 54s
Cloudflare Integration Tests
Bun Integration Tests
48s
Bun Integration Tests
Deno Integration Tests
48s
Deno Integration Tests
Check for faulty .d.ts files
42s
Check for faulty .d.ts files
Matrix: job_browser_loader_tests
Matrix: job_browser_playwright_tests
Matrix: job_optional_e2e_tests
Upload Artifacts
0s
Upload Artifacts
Matrix: job_e2e_tests
All required jobs passed or were skipped
5s
All required jobs passed or were skipped
Fit to window
Zoom out
Zoom in

Annotations

22 errors, 2 warnings, and 317 notices
Browser Unit Tests
Process completed with exit code 1.
test/tracing/browserTracingIntegration.test.ts > browserTracingIntegration > bfcache restores > emits the bfcache metric on the pre-freeze trace, before the navigation span exists: packages/browser/test/tracing/browserTracingIntegration.test.ts#L975
TypeError: Cannot spy on export "count". Module namespace is not configurable in ESM. See: https://vitest.dev/guide/browser/#limitations ❯ test/tracing/browserTracingIntegration.test.ts:975:27 Caused by: Caused by: TypeError: Cannot redefine property: count ❯ test/tracing/browserTracingIntegration.test.ts:975:27
E2E node-rolldown Test
Process completed with exit code 1.
E2E effect-3-browser Test
Process completed with exit code 1.
Size Check
Size limit has been exceeded.
E2E nextjs-16-cf-workers Test
Process completed with exit code 1.
[chromium] β€Ί tests/worker-bundle.test.ts:13:5 β€Ί worker bundle does not contain the orchestrion bundler plugins: ../../_temp/test-application/tests/worker-bundle.test.ts#L34
1) [chromium] β€Ί tests/worker-bundle.test.ts:13:5 β€Ί worker bundle does not contain the orchestrion bundler plugins Error: marker "__codeTransformerWebpackDiagnostics" is gone from the @sentry/server-utils plugin build β€” update the markers expect(received).toBe(expected) // Object.is equality Expected: true Received: false 32 | pluginGraphSources.some(source => source.includes(marker)), 33 | `marker "${marker}" is gone from the @sentry/server-utils plugin build β€” update the markers`, > 34 | ).toBe(true); | ^ 35 | } 36 | 37 | const leaks = serverFiles.filter(filePath => { at /home/runner/work/_temp/test-application/tests/worker-bundle.test.ts:34:7
E2E nextjs-16-cf-workers (latest) Test
Process completed with exit code 1.
[chromium] β€Ί tests/worker-bundle.test.ts:13:5 β€Ί worker bundle does not contain the orchestrion bundler plugins: ../../_temp/test-application/tests/worker-bundle.test.ts#L34
1) [chromium] β€Ί tests/worker-bundle.test.ts:13:5 β€Ί worker bundle does not contain the orchestrion bundler plugins Error: marker "__codeTransformerWebpackDiagnostics" is gone from the @sentry/server-utils plugin build β€” update the markers expect(received).toBe(expected) // Object.is equality Expected: true Received: false 32 | pluginGraphSources.some(source => source.includes(marker)), 33 | `marker "${marker}" is gone from the @sentry/server-utils plugin build β€” update the markers`, > 34 | ).toBe(true); | ^ 35 | } 36 | 37 | const leaks = serverFiles.filter(filePath => { at /home/runner/work/_temp/test-application/tests/worker-bundle.test.ts:34:7
[chromium] β€Ί tests/trpc-mutation.test.ts:4:5 β€Ί should create span with trpc input for mutation: ../../_temp/test-application/tests/trpc-mutation.test.ts#L0
2) [chromium] β€Ί tests/trpc-mutation.test.ts:4:5 β€Ί should create span with trpc input for mutation Test timeout of 30000ms exceeded.
[chromium] β€Ί tests/trpc-error.test.ts:4:5 β€Ί should capture error with trpc context: ../../_temp/test-application/tests/trpc-error.test.ts#L0
1) [chromium] β€Ί tests/trpc-error.test.ts:4:5 β€Ί should capture error with trpc context ──────────── Test timeout of 30000ms exceeded.
Node (24) Integration Tests
Process completed with exit code 1.
suites/esbuild/orchestrion-bundled/test.ts > esbuild + orchestrion build-time instrumentation > warns when an external instrumented dependency loads and no plugin ran: dev-packages/node-integration-tests/suites/esbuild/orchestrion-bundled/test.ts#L113
AssertionError: expected 'DEP_LOADED bundler_marker=false runti…' to contain 'runtime=[]' - Expected + Received - runtime=[] + DEP_LOADED bundler_marker=false runtime=["dataloader"] + ❯ suites/esbuild/orchestrion-bundled/test.ts:113:20
Node (22) Integration Tests
Process completed with exit code 1.
suites/esbuild/orchestrion-bundled/test.ts > esbuild + orchestrion build-time instrumentation > warns when an external instrumented dependency loads and no plugin ran: dev-packages/node-integration-tests/suites/esbuild/orchestrion-bundled/test.ts#L113
AssertionError: expected 'DEP_LOADED bundler_marker=false runti…' to contain 'runtime=[]' - Expected + Received - runtime=[] + DEP_LOADED bundler_marker=false runtime=["dataloader"] + ❯ suites/esbuild/orchestrion-bundled/test.ts:113:20
Node (26) Integration Tests
Process completed with exit code 1.
suites/esbuild/orchestrion-bundled/test.ts > esbuild + orchestrion build-time instrumentation > warns when an external instrumented dependency loads and no plugin ran: dev-packages/node-integration-tests/suites/esbuild/orchestrion-bundled/test.ts#L113
AssertionError: expected 'DEP_LOADED bundler_marker=false runti…' to contain 'runtime=[]' - Expected + Received - runtime=[] + DEP_LOADED bundler_marker=false runtime=["dataloader"] + ❯ suites/esbuild/orchestrion-bundled/test.ts:113:20
Node (24) (TS 5.0) Integration Tests
Process completed with exit code 1.
suites/esbuild/orchestrion-bundled/test.ts > esbuild + orchestrion build-time instrumentation > warns when an external instrumented dependency loads and no plugin ran: dev-packages/node-integration-tests/suites/esbuild/orchestrion-bundled/test.ts#L113
AssertionError: expected 'DEP_LOADED bundler_marker=false runti…' to contain 'runtime=[]' - Expected + Received - runtime=[] + DEP_LOADED bundler_marker=false runtime=["dataloader"] + ❯ suites/esbuild/orchestrion-bundled/test.ts:113:20
Node (20.19) Integration Tests
Process completed with exit code 1.
suites/esbuild/orchestrion-bundled/test.ts > esbuild + orchestrion build-time instrumentation > warns when an external instrumented dependency loads and no plugin ran: dev-packages/node-integration-tests/suites/esbuild/orchestrion-bundled/test.ts#L113
AssertionError: expected 'DEP_LOADED bundler_marker=false runti…' to contain 'runtime=[]' - Expected + Received - runtime=[] + DEP_LOADED bundler_marker=false runtime=["dataloader"] + ❯ suites/esbuild/orchestrion-bundled/test.ts:113:20
All required jobs passed or were skipped
Process completed with exit code 1.
E2E node-rolldown Test
No files were found with the provided path: /home/runner/work/_temp/test-application/test-results. No artifacts will be uploaded.
E2E effect-3-browser Test
No files were found with the provided path: /home/runner/work/_temp/test-application/test-results. No artifacts will be uploaded.
🎭 Playwright Run Summary
7 skipped 23 passed (11.1s)
🎭 Playwright Run Summary
5 skipped 25 passed (12.2s)
🎭 Playwright Run Summary
7 skipped 23 passed (10.6s)
🎭 Playwright Run Summary
4 skipped 26 passed (18.6s)
🎭 Playwright Run Summary
8 skipped 22 passed (10.6s)
🎭 Playwright Run Summary
1 skipped 29 passed (20.0s)
🎭 Playwright Run Summary
5 skipped 25 passed (20.4s)
🎭 Playwright Run Summary
14 passed (16.9s)
🎭 Playwright Run Summary
491 skipped 193 passed (40.6s)
🎭 Playwright Run Summary
1 skipped 19 passed (2.2s)
🎭 Playwright Run Summary
486 skipped 198 passed (43.5s)
🎭 Playwright Run Summary
3 skipped 17 passed (8.3s)
🎭 Playwright Run Summary
1 passed (3.4s)
🎭 Playwright Run Summary
1 skipped 19 passed (8.7s)
🎭 Playwright Run Summary
489 skipped 195 passed (42.4s)
🎭 Playwright Run Summary
4 passed (5.9s)
🎭 Playwright Run Summary
12 passed (11.4s)
🎭 Playwright Run Summary
19 passed (13.3s)
🎭 Playwright Run Summary
11 passed (11.5s)
🎭 Playwright Run Summary
11 passed (11.4s)
🎭 Playwright Run Summary
1 passed (3.5s)
🎭 Playwright Run Summary
1 passed (3.5s)
🎭 Playwright Run Summary
3 passed (4.9s)
🎭 Playwright Run Summary
16 passed (8.4s)
🎭 Playwright Run Summary
4 passed (6.3s)
🎭 Playwright Run Summary
8 passed (10.7s)
🎭 Playwright Run Summary
7 passed (5.2s)
🎭 Playwright Run Summary
7 passed (9.8s)
🎭 Playwright Run Summary
11 skipped 2 passed (4.1s)
🎭 Playwright Run Summary
4 passed (4.4s)
🎭 Playwright Run Summary
10 passed (10.4s)
🎭 Playwright Run Summary
1 skipped 73 passed (14.7s)
🎭 Playwright Run Summary
23 passed (16.6s)
🎭 Playwright Run Summary
3 passed (7.1s)
🎭 Playwright Run Summary
10 passed (10.3s)
🎭 Playwright Run Summary
4 skipped 10 passed (15.3s)
🎭 Playwright Run Summary
1 passed (3.3s)
🎭 Playwright Run Summary
23 passed (21.0s)
🎭 Playwright Run Summary
1 passed (6.1s)
🎭 Playwright Run Summary
16 passed (20.7s)
🎭 Playwright Run Summary
3 passed (4.0s)
🎭 Playwright Run Summary
16 passed (20.7s)
🎭 Playwright Run Summary
2 passed (3.5s)
🎭 Playwright Run Summary
7 passed (11.1s)
🎭 Playwright Run Summary
11 passed (20.9s)
🎭 Playwright Run Summary
1 skipped 73 passed (13.0s)
🎭 Playwright Run Summary
1 passed (6.6s)
🎭 Playwright Run Summary
15 passed (8.9s)
🎭 Playwright Run Summary
1 skipped 73 passed (15.6s)
🎭 Playwright Run Summary
5 passed (13.1s)
🎭 Playwright Run Summary
4 passed (8.3s)
🎭 Playwright Run Summary
3 passed (12.5s)
🎭 Playwright Run Summary
3 passed (11.2s)
🎭 Playwright Run Summary
10 passed (4.3s)
🎭 Playwright Run Summary
10 passed (4.7s)
🎭 Playwright Run Summary
2 passed (5.9s)
🎭 Playwright Run Summary
22 passed (16.0s)
🎭 Playwright Run Summary
8 passed (12.1s)
🎭 Playwright Run Summary
9 passed (15.4s)
🎭 Playwright Run Summary
1 passed (5.8s)
🎭 Playwright Run Summary
4 passed (2.6s)
🎭 Playwright Run Summary
2 skipped 14 passed (17.2s)
🎭 Playwright Run Summary
10 passed (19.1s)
🎭 Playwright Run Summary
4 passed (34.0s)
🎭 Playwright Run Summary
11 passed (6.3s)
🎭 Playwright Run Summary
8 passed (7.3s)
🎭 Playwright Run Summary
1 passed (4.8s)
🎭 Playwright Run Summary
1 passed (2.9s)
🎭 Playwright Run Summary
5 passed (12.4s)
🎭 Playwright Run Summary
5 passed (8.8s)
🎭 Playwright Run Summary
7 passed (3.3s)
🎭 Playwright Run Summary
12 passed (8.6s)
🎭 Playwright Run Summary
11 passed (10.2s)
🎭 Playwright Run Summary
13 passed (30.6s)
🎭 Playwright Run Summary
5 passed (11.1s)
🎭 Playwright Run Summary
4 passed (12.1s)
🎭 Playwright Run Summary
3 passed (5.4s)
🎭 Playwright Run Summary
1 skipped 16 passed (32.9s)
🎭 Playwright Run Summary
17 passed (31.1s)
🎭 Playwright Run Summary
11 passed (9.8s)
🎭 Playwright Run Summary
6 passed (13.9s)
🎭 Playwright Run Summary
12 passed (8.1s)
🎭 Playwright Run Summary
4 passed (10.9s)
🎭 Playwright Run Summary
6 passed (12.9s)
🎭 Playwright Run Summary
4 passed (8.1s)
🎭 Playwright Run Summary
1 skipped 73 passed (14.8s)
🎭 Playwright Run Summary
2 passed (2.4s)
🎭 Playwright Run Summary
23 passed (20.3s)
🎭 Playwright Run Summary
11 passed (9.9s)
🎭 Playwright Run Summary
8 skipped 6 passed (12.4s)
🎭 Playwright Run Summary
10 passed (21.1s)
🎭 Playwright Run Summary
2 passed (16.7s)
🎭 Playwright Run Summary
9 passed (11.1s)
🎭 Playwright Run Summary
7 passed (18.4s)
🎭 Playwright Run Summary
4 passed (18.9s)
🎭 Playwright Run Summary
4 passed (10.7s)
🎭 Playwright Run Summary
15 passed (18.9s)
🎭 Playwright Run Summary
9 passed (14.5s)
🎭 Playwright Run Summary
25 passed (20.1s)
🎭 Playwright Run Summary
14 passed (43.0s)
🎭 Playwright Run Summary
2 passed (29.4s)
🎭 Playwright Run Summary
5 passed (11.5s)
🎭 Playwright Run Summary
3 passed (3.0s)
🎭 Playwright Run Summary
5 passed (11.6s)
🎭 Playwright Run Summary
5 passed (14.9s)
🎭 Playwright Run Summary
4 passed (9.5s)
🎭 Playwright Run Summary
5 passed (8.3s)
🎭 Playwright Run Summary
2 passed (36.3s)
🎭 Playwright Run Summary
5 passed (6.2s)
🎭 Playwright Run Summary
1 passed (4.4s)
🎭 Playwright Run Summary
2 passed (4.1s)
🎭 Playwright Run Summary
2 passed (4.1s)
🎭 Playwright Run Summary
9 passed (11.5s)
🎭 Playwright Run Summary
2 passed (27.7s)
🎭 Playwright Run Summary
25 passed (52.6s)
🎭 Playwright Run Summary
4 passed (13.6s)
🎭 Playwright Run Summary
13 passed (44.9s)
🎭 Playwright Run Summary
12 passed (37.0s)
🎭 Playwright Run Summary
355 skipped 329 passed (1.6m)
🎭 Playwright Run Summary
8 passed (8.7s)
🎭 Playwright Run Summary
6 passed (14.5s)
🎭 Playwright Run Summary
5 passed (13.8s)
🎭 Playwright Run Summary
10 passed (41.2s)
🎭 Playwright Run Summary
2 skipped 7 passed (33.3s)
🎭 Playwright Run Summary
30 passed (35.1s)
🎭 Playwright Run Summary
3 passed (22.1s)
🎭 Playwright Run Summary
3 passed (12.9s)
🎭 Playwright Run Summary
9 passed (12.4s)
🎭 Playwright Run Summary
9 passed (3.6s)
🎭 Playwright Run Summary
3 passed (21.6s)
🎭 Playwright Run Summary
3 passed (12.8s)
🎭 Playwright Run Summary
9 passed (3.7s)
🎭 Playwright Run Summary
2 passed (29.8s)
🎭 Playwright Run Summary
5 passed (8.6s)
🎭 Playwright Run Summary
10 passed (12.4s)
🎭 Playwright Run Summary
12 passed (33.0s)
🎭 Playwright Run Summary
3 passed (6.0s)
🎭 Playwright Run Summary
16 passed (10.9s)
🎭 Playwright Run Summary
5 passed (11.1s)
🎭 Playwright Run Summary
1 skipped 12 passed (28.0s)
🎭 Playwright Run Summary
11 passed (21.1s)
🎭 Playwright Run Summary
22 passed (46.2s)
🎭 Playwright Run Summary
12 passed (40.7s)
🎭 Playwright Run Summary
14 passed (42.6s)
🎭 Playwright Run Summary
10 passed (23.1s)
🎭 Playwright Run Summary
10 passed (13.5s)
🎭 Playwright Run Summary
22 skipped 2 passed (3.2s)
🎭 Playwright Run Summary
13 passed (45.0s)
🎭 Playwright Run Summary
12 passed (22.0s)
🎭 Playwright Run Summary
11 passed (20.3s)
🎭 Playwright Run Summary
14 passed (44.0s)
🎭 Playwright Run Summary
3 passed (15.6s)
🎭 Playwright Run Summary
3 passed (9.9s)
🎭 Playwright Run Summary
354 skipped 330 passed (1.5m)
🎭 Playwright Run Summary
3 passed (15.8s)
🎭 Playwright Run Summary
3 passed (13.2s)
🎭 Playwright Run Summary
4 passed (3.9s)
🎭 Playwright Run Summary
9 passed (36.6s)
🎭 Playwright Run Summary
3 passed (32.1s)
🎭 Playwright Run Summary
4 passed (5.4s)
🎭 Playwright Run Summary
4 passed (21.7s)
🎭 Playwright Run Summary
4 passed (13.1s)
🎭 Playwright Run Summary
21 skipped 3 passed (3.8s)
🎭 Playwright Run Summary
10 passed (19.4s)
🎭 Playwright Run Summary
10 passed (5.9s)
🎭 Playwright Run Summary
10 passed (29.3s)
🎭 Playwright Run Summary
1 failed [chromium] β€Ί tests/worker-bundle.test.ts:13:5 β€Ί worker bundle does not contain the orchestrion bundler plugins 16 skipped 11 passed (27.3s)
🎭 Playwright Run Summary
10 passed (11.9s)
🎭 Playwright Run Summary
30 passed (36.3s)
🎭 Playwright Run Summary
12 passed (41.4s)
🎭 Playwright Run Summary
12 passed (41.0s)
🎭 Playwright Run Summary
17 passed (1.1m)
🎭 Playwright Run Summary
4 passed (13.7s)
🎭 Playwright Run Summary
10 passed (32.3s)
🎭 Playwright Run Summary
22 skipped 2 passed (4.8s)
🎭 Playwright Run Summary
15 passed (28.5s)
🎭 Playwright Run Summary
5 passed (34.3s)
🎭 Playwright Run Summary
5 passed (34.8s)
🎭 Playwright Run Summary
9 passed (17.8s)
🎭 Playwright Run Summary
2 skipped 10 passed (6.9s)
🎭 Playwright Run Summary
2 skipped 10 passed (6.9s)
🎭 Playwright Run Summary
15 passed (1.2m)
🎭 Playwright Run Summary
1 skipped 11 passed (30.5s)
🎭 Playwright Run Summary
12 passed (10.4s)
🎭 Playwright Run Summary
13 passed (42.7s)
🎭 Playwright Run Summary
13 passed (36.0s)
🎭 Playwright Run Summary
53 passed (34.7s)
🎭 Playwright Run Summary
12 passed (39.9s)
🎭 Playwright Run Summary
4 passed (10.8s)
🎭 Playwright Run Summary
22 passed (49.3s)
🎭 Playwright Run Summary
1 failed [chromium] β€Ί tests/worker-bundle.test.ts:13:5 β€Ί worker bundle does not contain the orchestrion bundler plugins 16 skipped 11 passed (25.1s)
🎭 Playwright Run Summary
11 passed (40.8s)
🎭 Playwright Run Summary
22 skipped 2 passed (5.2s)
🎭 Playwright Run Summary
14 passed (43.5s)
🎭 Playwright Run Summary
40 passed (35.3s)
🎭 Playwright Run Summary
3 passed (30.6s)
🎭 Playwright Run Summary
3 passed (7.4s)
🎭 Playwright Run Summary
2 passed (19.2s)
🎭 Playwright Run Summary
12 passed (17.2s)
🎭 Playwright Run Summary
13 passed (35.8s)
🎭 Playwright Run Summary
12 passed (17.3s)
🎭 Playwright Run Summary
22 passed (48.6s)
🎭 Playwright Run Summary
2 passed (16.7s)
🎭 Playwright Run Summary
13 passed (38.3s)
🎭 Playwright Run Summary
6 passed (43.7s)
🎭 Playwright Run Summary
11 passed (37.8s)
🎭 Playwright Run Summary
6 skipped 7 passed (35.1s)
🎭 Playwright Run Summary
13 passed (19.1s)
🎭 Playwright Run Summary
25 passed (58.9s)
🎭 Playwright Run Summary
14 passed (31.9s)
🎭 Playwright Run Summary
9 passed (12.4s)
🎭 Playwright Run Summary
40 passed (35.0s)
🎭 Playwright Run Summary
1 skipped 11 passed (39.1s)
🎭 Playwright Run Summary
12 passed (7.6s)
🎭 Playwright Run Summary
22 passed (51.3s)
🎭 Playwright Run Summary
6 passed (35.4s)
🎭 Playwright Run Summary
5 passed (35.0s)
🎭 Playwright Run Summary
5 passed (34.3s)
🎭 Playwright Run Summary
4 passed (3.7s)
🎭 Playwright Run Summary
2 passed (19.1s)
🎭 Playwright Run Summary
15 passed (54.4s)
🎭 Playwright Run Summary
2 flaky [chromium] β€Ί tests/trpc-error.test.ts:4:5 β€Ί should capture error with trpc context ───────────── [chromium] β€Ί tests/trpc-mutation.test.ts:4:5 β€Ί should create span with trpc input for mutation ─ 1 passed (40.5s)
🎭 Playwright Run Summary
3 passed (4.4s)
🎭 Playwright Run Summary
2 passed (18.5s)
🎭 Playwright Run Summary
15 passed (54.1s)
🎭 Playwright Run Summary
4 skipped 12 passed (33.8s)
🎭 Playwright Run Summary
2 skipped 14 passed (16.1s)
🎭 Playwright Run Summary
2 passed (16.5s)
🎭 Playwright Run Summary
18 passed (1.1m)
🎭 Playwright Run Summary
4 skipped 167 passed (2.4m)
🎭 Playwright Run Summary
22 passed (41.7s)
🎭 Playwright Run Summary
4 passed (18.2s)
🎭 Playwright Run Summary
4 skipped 51 passed (1.2m)
🎭 Playwright Run Summary
2 passed (20.1s)
🎭 Playwright Run Summary
11 passed (42.0s)
🎭 Playwright Run Summary
2 passed (21.2s)
🎭 Playwright Run Summary
3 skipped 21 passed (47.8s)
🎭 Playwright Run Summary
2 passed (17.2s)
🎭 Playwright Run Summary
18 passed (54.5s)
🎭 Playwright Run Summary
17 passed (1.1m)
🎭 Playwright Run Summary
5 passed (39.6s)
🎭 Playwright Run Summary
5 passed (13.3s)
🎭 Playwright Run Summary
10 passed (57.4s)
🎭 Playwright Run Summary
9 passed (30.3s)
🎭 Playwright Run Summary
9 passed (11.8s)
🎭 Playwright Run Summary
3 passed (39.7s)
🎭 Playwright Run Summary
3 passed (13.8s)
🎭 Playwright Run Summary
4 skipped 12 passed (36.1s)
🎭 Playwright Run Summary
2 skipped 14 passed (15.9s)
🎭 Playwright Run Summary
2 passed (19.8s)
🎭 Playwright Run Summary
2 skipped 21 passed (38.7s)
🎭 Playwright Run Summary
13 passed (53.0s)
🎭 Playwright Run Summary
13 passed (16.0s)
🎭 Playwright Run Summary
1 skipped 170 passed (2.5m)
🎭 Playwright Run Summary
13 passed (52.6s)
🎭 Playwright Run Summary
13 passed (17.1s)
🎭 Playwright Run Summary
6 skipped 7 passed (55.2s)
🎭 Playwright Run Summary
13 passed (18.7s)
🎭 Playwright Run Summary
9 passed (1.0m)
🎭 Playwright Run Summary
9 passed (8.6s)
🎭 Playwright Run Summary
9 passed (34.4s)
🎭 Playwright Run Summary
4 skipped 30 passed (57.9s)
🎭 Playwright Run Summary
2 skipped 32 passed (1.2m)
🎭 Playwright Run Summary
60 skipped 624 passed (4.3m)
🎭 Playwright Run Summary
4 passed (12.8s)
🎭 Playwright Run Summary
4 passed (29.9s)
🎭 Playwright Run Summary
4 passed (9.2s)
🎭 Playwright Run Summary
5 skipped 166 passed (3.3m)
🎭 Playwright Run Summary
4 passed (19.1s)
🎭 Playwright Run Summary
13 passed (52.8s)
🎭 Playwright Run Summary
13 passed (15.9s)
🎭 Playwright Run Summary
5 skipped 30 passed (1.4m)
🎭 Playwright Run Summary
5 skipped 30 passed (49.9s)
🎭 Playwright Run Summary
197 skipped 487 passed (3.7m)
🎭 Playwright Run Summary
1 skipped 5 passed (30.4s)
🎭 Playwright Run Summary
58 passed (1.6m)
🎭 Playwright Run Summary
1 skipped 5 passed (27.6s)
🎭 Playwright Run Summary
58 passed (1.6m)
🎭 Playwright Run Summary
193 skipped 491 passed (3.8m)
🎭 Playwright Run Summary
1 skipped 5 passed (27.3s)
🎭 Playwright Run Summary
58 passed (1.7m)
🎭 Playwright Run Summary
4 skipped 167 passed (4.0m)
🎭 Playwright Run Summary
187 skipped 497 passed (3.8m)
🎭 Playwright Run Summary
67 passed (2.2m)
🎭 Playwright Run Summary
1 skipped 5 passed (32.1s)
🎭 Playwright Run Summary
67 passed (2.2m)
🎭 Playwright Run Summary
44 passed (2.6m)
🎭 Playwright Run Summary
56 skipped 628 passed (4.5m)
🎭 Playwright Run Summary
56 skipped 628 passed (4.5m)
🎭 Playwright Run Summary
60 skipped 624 passed (4.6m)
🎭 Playwright Run Summary
58 skipped 626 passed (4.7m)
🎭 Playwright Run Summary
1 skipped 5 passed (29.3s)
🎭 Playwright Run Summary
67 passed (2.2m)
🎭 Playwright Run Summary
1 skipped 5 passed (31.3s)
🎭 Playwright Run Summary
67 passed (2.2m)
🎭 Playwright Run Summary
15 skipped 32 passed (1.8m)
🎭 Playwright Run Summary
5 skipped 42 passed (1.3m)
🎭 Playwright Run Summary
16 skipped 32 passed (1.8m)
🎭 Playwright Run Summary
5 skipped 43 passed (1.6m)
🎭 Playwright Run Summary
16 skipped 32 passed (2.0m)
🎭 Playwright Run Summary
5 skipped 43 passed (1.6m)
🎭 Playwright Run Summary
5 skipped 30 passed (2.3m)
🎭 Playwright Run Summary
4 skipped 31 passed (50.9s)
🎭 Playwright Run Summary
5 skipped 30 passed (2.2m)
🎭 Playwright Run Summary
4 skipped 31 passed (50.2s)
🎭 Playwright Run Summary
13 skipped 35 passed (2.4m)
🎭 Playwright Run Summary
5 skipped 43 passed (1.5m)
🎭 Playwright Run Summary
16 skipped 32 passed (1.9m)
🎭 Playwright Run Summary
5 skipped 43 passed (1.8m)
🎭 Playwright Run Summary
2 skipped 32 passed (2.8m)
🎭 Playwright Run Summary
2 skipped 32 passed (1.3m)
🎭 Playwright Run Summary
13 skipped 35 passed (2.7m)
🎭 Playwright Run Summary
5 skipped 43 passed (1.6m)
🎭 Playwright Run Summary
2 skipped 32 passed (3.2m)
🎭 Playwright Run Summary
2 skipped 32 passed (1.3m)
🎭 Playwright Run Summary
13 skipped 35 passed (3.0m)
🎭 Playwright Run Summary
5 skipped 43 passed (1.6m)

Artifacts

Produced during runtime
Name Size Digest
E2E Test Dump (nextjs-16-cf-workers (latest))
31.1 KB
sha256:7e1bc9112e8688e0925c5239ea28dad1371bc43b8e077c9c841aae97827799bb
E2E Test Dump (nextjs-16-cf-workers)
34.1 KB
sha256:b7d0671af389f7f62bb3212851ff2b33aeb31cc6b8c25e84ebdc2ff0b9859d6a
build-bundle-output
19.1 MB
sha256:568869072e2fa24a315e0c4988d2388679c37968007436691e559492a3c545e6
build-layer-output
1.62 MB
sha256:6e4a15151b388d5b2ff56f1bdf6778d77885ccc1199553c975ea8b550efd7b51
build-output
16.6 MB
sha256:d96840d4aee51d78640bd0b232a21c802ec5e1e40640f10e57b3bdc67a5f7e49
build-tarball-output
8.21 MB
sha256:1279481d62e3187bd7729b8dcfc24ffb6cdaa4e45c29438de209544092da8ff0
playwright-traces-job_e2e_playwright_tests-nextjs-16-cf-workers
7.02 KB
sha256:89403c1151287fa34073ea41eb66afa74cd2b18e231868e928f041e74af731c8